{"text_format":"1","workbook":"xlsx","n_sheets":13,"sheets":["1","Data","Shapes","Temp","viz","viz2","Missing","Colors","Stat","vp","Cursed","Dis","Ivls"],"not_rendered":{"charts":0,"images":0,"macros":1,"external_links":0,"defined_names":2,"comments":3,"pivot_tables":1},"unopened":[],"bounds":{"document_bytes":16777216,"sheet_cells":100000,"rows_first":2000,"rows_last":500,"rows_between":2000,"halvings":0,"cell_chars":16384,"cell_head_chars":4096},"cells_cut":0,"cells_raw":0,"read":"whole","date_system":"1900"}

{"sheet":"1","index":0,"n_rows":229,"n_cols":24,"rows_kept":229,"cut":false,"hidden":false,"merged":[[37,1,55,1],[56,1,74,1],[119,1,129,1],[130,1,131,1],[106,1,118,1],[83,1,98,1],[99,1,105,1],[24,0,129,0],[19,1,23,1],[1,0,23,0],[165,1,169,1],[170,1,176,1],[130,0,207,0],[75,1,82,1],[180,1,191,1],[192,1,201,1],[177,1,179,1],[1,1,18,1],[202,1,207,1],[147,1,164,1],[132,1,146,1],[25,1,32,1],[33,1,36,1],[0,5,0,12],[82,5,82,6],[76,5,76,6],[75,5,75,6],[77,5,77,6],[78,5,78,6],[81,5,81,6],[80,5,80,6],[79,5,79,6]]}
["CL","Group","Rule","Spec","Voice","Subrules",null,null,null,null,null,null,null,null,"Comment",null,"IDs"]
["Rhythm","Rhythm","Beginning is non-standard",null,null,"1/8 note",null,null,null,null,null,null,null,null,null,null,230]
[null,null,"Misuse of rest",null,null,"wrong starting rest","rest inside","late entrance",null,null,null,null,null,null,null,null,138,517,527]
[null,null,"Missing rest",null,null,"/no starting rest",null,null,null,null,null,null,null,null,null,null,237]
[null,null,"Simultaneous entries of voices",null,null,"/simultaneous",null,null,null,null,null,null,null,null,null,null,530]
[null,null,"Same rhythm in adjacent measures",null,null,"/same",null,null,null,null,null,null,null,null,null,null,247]
[null,null,"Identical rhythm in two parts",null,null,"/same",null,null,null,null,null,null,null,null,null,null,549]
[null,null,"Identical rhythm in all parts",null,null,"/same",null,null,null,null,null,null,null,null,"For any species except species 1",null,215]
[null,null,"Non-permitted rhythm",null,null,"1/2. downbeat","1/2. upbeat","1/4 syncope","rhythm stagnation","whole inside",null,null,null,null,null,null,233,234,235,236,160]
[null,null,"Wrong usage of eighth notes",null,null,"1st beat","2nd beat","3rd beat","4th beat","isolated","1/8 syncope",">2 x 1/8","leap",null,null,null,226,227,228,229,231,232,255,88]
[null,null,"Anapaest",null,null,"tie forward","inside",null,null,null,null,null,null,null,"1/2 after 1/4 or 1/8 in measure",null,239,240]
[null,null,"Wrong note value for this species",null,null,"/value",null,null,null,null,null,null,null,null,"Except last note",null,514]
[null,null,"Wrong time signature for this species",null,null,"/measure len",null,null,null,null,null,null,null,null,null,null,525]
[null,null,"Wrong positioning of note for this species",null,null,"/position",null,null,null,null,null,null,null,null,null,null,515]
[null,null,"Note lasts for too many measures",null,null,">2",null,null,null,null,null,null,null,null,null,null,41]
[null,null,"The length of last note is not full measure",null,null,"/not full measure",null,null,null,null,null,null,null,null,null,null,267]
[null,null,"Wrong suspension rhythm",null,null,"sus wrong length","prep < sus","prep wrong length",null,null,null,null,null,null,"Suspension preparation and suspension",null,244,427,274]
[null,null,"Need more suspensions",null,null,"each 3 meas.",null,null,null,null,null,null,null,null,null,null,341]
[null,null,"Too many notes in one measure",null,null,"5 notes after sus.","5 notes without sus.",">5 notes",null,null,null,null,null,null,null,null,301,245,246]
[null,"Repeats and ties","Note repeat",null,null,"cantus","inside measure",null,null,null,null,null,null,null,null,null,30,516]
[null,null,"Simultaneous repeats of notes in multiple parts",null,null,"/multivoice",null,null,null,null,null,null,null,null,null,null,557]
[null,null,"Note is repeated: in 10 notes",10,null,1,2,">2",null,null,null,null,null,null,"Note repeat happens several times",null,93,94,95]
[null,null,"Note is repeated: in 10 notes",2,null,1,2,">2",null,null,null,null,null,null,"Note repeat happens several times",null,93,94,95]
[null,null,"Frequent interruption of syncopation: within 10 notes",4,null,1,2,">2",null,null,null,null,null,null,"Except interruption of syncopation between penultimate and last measure",null,188,189,190]
["Melody","Border","Leading tone is unresolved",null,null,"need up","need stepwise",null,null,null,null,null,null,null,null,null,197,198]
[null,"Compensated leap","Uncompensated leap: compensation deviation to 2nd",null,"E","3rd","4th","5th",">5th","late >3",">5th long",null,null,null,"Compensation can be deviated one 2nd interval above last leap note",null,42,43,44,45,191,386]
[null,null,"Uncompensated leap: compensation deviation to 3rd",1240,"E","3rd","4th","5th",">5th","late >3",null,null,null,null,"Compensation can be deviated one 3rd interval above last leap note",null,120,121,122,123,192]
[null,null,"Uncompensated leap: compensation deviation to 3rd",35,"E","3rd","4th","5th",">5th","late >3",null,null,null,null,"Compensation can be deviated one 3rd interval above last leap note",null,120,121,122,123,192]
[null,null,"Compensation after 3rd",null,"E","3rd","4th","5th",">5th",null,null,null,null,null,"Compensation has a gap of one 3rd below last leap note",null,53,54,55,56]
[null,null,"Compensated to 3rd prepared",null,"E","-","4th","5th",">5th",null,null,null,null,null,"Prepared within 5 notes",null,100,101,102,103]
{"$rows_left_out":200}
{"sheet":"Data","index":1,"n_rows":417,"n_cols":26,"rows_kept":417,"cut":false,"hidden":false,"merged":[]}
["Rid","Class","Group","Rule","Subrule","VIZ","VI","VC","VH","VS","VT","FQ","CF","GFP","IFP","DEU","MEI","ER","UE","R","Severity","Flag","Spec","Voice","GComment","Comment"]
[1,"Melody","Uncompensated leap","Uncompensated leap","start 3rd","5",null,"1",null,null,null,{"$f":"VLOOKUP($A2, Stat!$A$1:$C$1000, 2,0)","v":15},{"$f":"VLOOKUP($A2, Stat!$A$1:$C$1000, 3,0)","v":1},1,null,null,null,null,null,null,0,-1,null,"E","If no other uncompensated rules worked."]
[2,"Melody","Tritone","Tritone: adjacent",":resolved","13",null,"1",null,null,null,{"$f":"VLOOKUP($A3, Stat!$A$1:$C$1000, 2,0)","v":8},{"$f":"VLOOKUP($A3, Stat!$A$1:$C$1000, 3,0)","v":2},1,null,null,null,null,null,null,50,-1,10,null,"Melodic adjacent tritone","Search 4 quarters for resolution if penultimate measure"]
[3,"Harmony","Nonchord tones","Double-neighbor tone","approached by leap",null,null,"1",null,null,null,{"$f":"VLOOKUP($A4, Stat!$A$1:$C$1000, 2,0)","v":0},{"$f":"VLOOKUP($A4, Stat!$A$1:$C$1000, 3,0)","v":0},null,null,null,null,null,null,null,0,-1,null,null,null,"There is a leap before first note of double-neighbour tone group"]
[8,"Melody","Change of melodic direction around leap","Leap back","<=6th","5",null,"1",null,null,null,{"$f":"VLOOKUP($A5, Stat!$A$1:$C$1000, 2,0)","v":491},{"$f":"VLOOKUP($A5, Stat!$A$1:$C$1000, 3,0)","v":1},null,null,null,null,null,null,null,0,-1,null,"E",null,"After leap there is an immediate returning leap in the opposite direction. This returning leap is a 6th or shorter"]
[10,"Melody","Melodic repeats","Frequent return to the same note",">3 in 7 notes","9",null,"1",null,null,"Stagnation",{"$f":"VLOOKUP($A6, Stat!$A$1:$C$1000, 2,0)","v":39},{"$f":"VLOOKUP($A6, Stat!$A$1:$C$1000, 3,0)","v":1},null,1,null,null,null,null,null,0,-1,null,"E","Same note repeats more than AA times within BB adjacent notes"]
[12,"Melody","Melodic repeats","Melodic climax is repeated","in upper part",null,null,"1",null,null,null,{"$f":"VLOOKUP($A7, Stat!$A$1:$C$1000, 2,0)","v":108},{"$f":"VLOOKUP($A7, Stat!$A$1:$C$1000, 3,0)","v":39},1,null,null,null,"21,78,79,193",null,null,100,0,null,"E",null,"Multiple culminations in higher voice"]
[15,"Melody","Range","No melody development","12 notes <12","9",null,"1",null,null,"Stagnation",{"$f":"VLOOKUP($A8, Stat!$A$1:$C$1000, 2,0)","v":36},{"$f":"VLOOKUP($A8, Stat!$A$1:$C$1000, 3,0)","v":2},null,1,null,1,null,null,null,0,1,null,"E",null,"Averaged melody direction within AA notes is less than BB deci-semitones"]
[16,"Melody","Range","No melody development","15 notes <15","9",null,"1",null,null,"Stagnation",{"$f":"VLOOKUP($A9, Stat!$A$1:$C$1000, 2,0)","v":20},{"$f":"VLOOKUP($A9, Stat!$A$1:$C$1000, 3,0)","v":1},null,1,null,null,null,null,null,0,1,null,"E",null,"Averaged melody direction within AA notes is less than BB deci-semitones"]
[17,"Harmony","Harmony","Repeating functions in a row",">4 T","9",null,"1",null,null,"Weak prog.",{"$f":"VLOOKUP($A10, Stat!$A$1:$C$1000, 2,0)","v":6},{"$f":"VLOOKUP($A10, Stat!$A$1:$C$1000, 3,0)","v":0},null,1,null,null,null,null,"17,20,23,48,57,77,92,99,428,429,430,431",0,-1,null,null,"More than AA consecutive harmonies all have this letter"]
[18,"Melody","Tritone","Audible tritone: framed",":resolved","13",null,"1",null,null,null,{"$f":"VLOOKUP($A11, Stat!$A$1:$C$1000, 2,0)","v":4},{"$f":"VLOOKUP($A11, Stat!$A$1:$C$1000, 3,0)","v":0},1,null,null,null,null,null,null,0,-1,2345,null,"Tritone within measure with intermediate notes, framed by two melody direction changes"]
[19,"Melody","Tritone","Audible tritone: framed",":unresolved","13",null,"1",null,null,null,{"$f":"VLOOKUP($A12, Stat!$A$1:$C$1000, 2,0)","v":33},{"$f":"VLOOKUP($A12, Stat!$A$1:$C$1000, 3,0)","v":21},1,null,null,null,"18",null,null,50,-1,2345,null,"Tritone within measure with intermediate notes, framed by two melody direction changes"]
[20,"Harmony","Harmony","Missing functions in a row",">5 without T","9",null,"1",null,null,"No T",{"$f":"VLOOKUP($A13, Stat!$A$1:$C$1000, 2,0)","v":5},{"$f":"VLOOKUP($A13, Stat!$A$1:$C$1000, 3,0)","v":0},null,1,null,null,null,null,"17,20,23,48,57,77,92,99,428,429,430,431",0,-1,null,null,"More than AA consecutive harmonies do not have this letter"]
[21,"Melody","Melodic repeats","Melodic climax","late 3",null,null,"1",null,null,null,{"$f":"VLOOKUP($A14, Stat!$A$1:$C$1000, 2,0)","v":198},{"$f":"VLOOKUP($A14, Stat!$A$1:$C$1000, 3,0)","v":1},null,null,null,1,null,null,null,0,1,null,"E",null,"Only for upper voice"]
[22,"Melody","Change of melodic direction around leap","Leap back",">6th","5",null,"1",null,null,null,{"$f":"VLOOKUP($A15, Stat!$A$1:$C$1000, 2,0)","v":24},{"$f":"VLOOKUP($A15, Stat!$A$1:$C$1000, 3,0)","v":12},1,null,null,null,null,null,null,0,-1,null,"E",null,"After leap there is an immediate returning leap in the opposite direction. This returning leap is longer than 6th"]
[23,"Harmony","Harmony","Harmonic progression","3 x bad","9",null,"1","4",null,"Weak prog.",{"$f":"VLOOKUP($A16, Stat!$A$1:$C$1000, 2,0)","v":19},{"$f":"VLOOKUP($A16, Stat!$A$1:$C$1000, 3,0)","v":1},null,null,null,null,null,null,"17,20,23,48,57,77,92,99,428,429,430,431",0,-1,null,null,null,"Three consecutive harmonic progressions each with penalty 2"]
[24,"Harmony","Voice motion","Voice overlapping","adjacent voices","10",null,"1",null,null,"Overlap",{"$f":"VLOOKUP($A17, Stat!$A$1:$C$1000, 2,0)","v":54},{"$f":"VLOOKUP($A17, Stat!$A$1:$C$1000, 3,0)","v":9},1,null,null,null,null,null,null,50,0]
[29,"Harmony","Voice motion","Voice overlapping","adjacent (touch)","10",null,"1",null,null,"Overlap",null,null,null,null,null,null,null,null,null,50,-1]
[25,"Melody","Change of melodic direction around leap","No change of direction before the leap between measures: >1skip + close","3rd",5,null,"1",null,null,null,null,null,1,null,null,null,null,null,null,50,-1,null,"E","There is immediate melody direction change after leap, but before leap melody direction changes after more than one note, which go in the same direction as leap"]
[26,"Melody","Change of melodic direction around leap","No change of direction before the leap between measures: >1skip + close","4th",5,null,"1",null,null,null,null,null,1,null,null,null,null,null,null,50,-1,null,"E","There is immediate melody direction change after leap, but before leap melody direction changes after more than one note, which go in the same direction as leap"]
[27,"Melody","Change of melodic direction around leap","No change of direction before the leap between measures: >1skip + close","5th",5,null,"1",null,null,null,null,null,1,null,null,null,null,null,null,100,-1,null,"E","There is immediate melody direction change after leap, but before leap melody direction changes after more than one note, which go in the same direction as leap"]
[28,"Melody","Change of melodic direction around leap","No change of direction before the leap between measures: >1skip + close",">5th",5,null,"1",null,null,null,null,null,1,null,null,null,null,null,null,100,0,null,"E","There is immediate melody direction change after leap, but before leap melody direction changes after more than one note, which go in the same direction as leap"]
[30,"Rhythm","Repeats and ties","Note repeat","cantus","11",null,"1",null,null,"Repeated note",{"$f":"VLOOKUP($A23, Stat!$A$1:$C$1000, 2,0)","v":0},{"$f":"VLOOKUP($A23, Stat!$A$1:$C$1000, 3,0)","v":0},1,null,null,null,null,null,null,100,-1,null,null,null,"Slurs are prohibited in cantus"]
[31,"Melody","Tritone","Tritone: adjacent",":unresolved","13",null,"1",null,null,null,{"$f":"VLOOKUP($A24, Stat!$A$1:$C$1000, 2,0)","v":29},{"$f":"VLOOKUP($A24, Stat!$A$1:$C$1000, 3,0)","v":3},null,null,null,null,"2",null,null,100,-1,10,null,"Melodic adjacent tritone"]
[36,"Harmony","Dissonance","Non-chord tone approached by leap","/leap",null,null,"1",null,null,null,null,null,null,null,null,null,"276,169",null,null,100,-1,null,null,null,"Leap to harmonic upbeat dissonance"]
[39,"Melody","Melodic repeats","Frequent return to the same note",">4 in 9 notes","9",null,"1",null,null,"Stagnation",{"$f":"VLOOKUP($A26, Stat!$A$1:$C$1000, 2,0)","v":21},{"$f":"VLOOKUP($A26, Stat!$A$1:$C$1000, 3,0)","v":0},null,null,null,null,null,null,null,50,0,null,"E","Same note repeats more than AA times within BB adjacent notes"]
[41,"Rhythm","Rhythm","Note lasts for too many measures",">2",null,null,"1",null,null,null,{"$f":"VLOOKUP($A27, Stat!$A$1:$C$1000, 2,0)","v":15},{"$f":"VLOOKUP($A27, Stat!$A$1:$C$1000, 3,0)","v":12},1,null,null,null,null,null,null,50,-1,null,null,null,"Note crosses more than two measures"]
[42,"Melody","Compensated leap","Uncompensated leap: compensation deviation to 2nd","3rd","5",null,"1",null,null,null,{"$f":"VLOOKUP($A28, Stat!$A$1:$C$1000, 2,0)","v":199},{"$f":"VLOOKUP($A28, Stat!$A$1:$C$1000, 3,0)","v":0},null,null,999,null,null,null,null,0,-1,null,"E","Compensation can be deviated one 2nd interval above last leap note"]
[43,"Melody","Compensated leap","Uncompensated leap: compensation deviation to 2nd","4th","5",null,"1",null,null,null,{"$f":"VLOOKUP($A29, Stat!$A$1:$C$1000, 2,0)","v":88},{"$f":"VLOOKUP($A29, Stat!$A$1:$C$1000, 3,0)","v":0},null,null,999,null,null,null,null,0,-1,null,"E","Compensation can be deviated one 2nd interval above last leap note"]
[44,"Melody","Compensated leap","Uncompensated leap: compensation deviation to 2nd","5th","5",null,"1",null,null,null,{"$f":"VLOOKUP($A30, Stat!$A$1:$C$1000, 2,0)","v":76},{"$f":"VLOOKUP($A30, Stat!$A$1:$C$1000, 3,0)","v":0},null,null,999,null,null,null,null,0,-1,null,"E","Compensation can be deviated one 2nd interval above last leap note"]
{"$rows_left_out":388}
{"sheet":"Shapes","index":2,"n_rows":21,"n_cols":3,"rows_kept":21,"cut":false,"hidden":false,"merged":[]}
[null,"Text","ABCjs alternative"]
["0. Just flag number","yes"]
["1. Harmony","no"]
["2. Interval","no"]
["3. Vertical brackets","no","no color"]
["4. Volta repeat","yes"]
["5. Slurs","no","no color"]
["6. Phrasing slurs","no"]
["7. Glissando","yes (if neighboring notes)"]
["8. Analysis brackets","yes"]
["9. Trills","yes","issue created"]
["10. TextSpanner","yes"]
["11. Ottava bracket","yes"]
["12. Pedal bracket","yes"]
["13. Note name","no"]
["14. Staccato"]
["15. Staccattissimo"]
["16. Note color","no"]
["17. Petrucci notehead"]
["18. Cross on a stem"]
["19. Circle around notehead","no","muted note (x)"]

{"sheet":"Temp","index":3,"n_rows":16,"n_cols":23,"rows_kept":16,"cut":false,"hidden":false,"merged":[]}
["Rid","Class","Group","Rule","Subrule","VIZ","VI","V2","VT","FQ","CF","GFP","IFP","DEU","MEI","ER","UE","R","Severity","Flag","GComment","Comment","Set"]
[3,"Melody","Leaps","Many leaps within 9 notes",">8 leaps","10",null,null,"!srn!",{"$f":"VLOOKUP($A2, Stat!$A$1:$C$501, 2,0)","v":0},{"$f":"VLOOKUP($A2, Stat!$A$1:$C$501, 3,0)","v":0},null,null,null,1,"311",null,null,60,0,null,null,1]
[25,"Melody","Leaps","Many leaps within 9 notes",">30 notes","10",null,null,"Many leaps",{"$f":"VLOOKUP($A3, Stat!$A$1:$C$501, 2,0)","v":0},{"$f":"VLOOKUP($A3, Stat!$A$1:$C$501, 3,0)","v":0},null,null,null,1,"312",null,null,60,0,null,"Total leaps length more than X notes:  3 is third, 4 is fourth and so on",1]
[202,"Melody","Leaps","Many leaps within 15 notes",">12 leaps","10",null,null,"!srn!",{"$f":"VLOOKUP($A4, Stat!$A$1:$C$501, 2,0)","v":0},{"$f":"VLOOKUP($A4, Stat!$A$1:$C$501, 3,0)","v":0},null,null,null,1,"313",null,null,60,0,null,null,1]
[203,"Melody","Leaps","Many leaps within 15 notes",">42 notes","10",null,null,"Many leaps",{"$f":"VLOOKUP($A5, Stat!$A$1:$C$501, 2,0)","v":0},{"$f":"VLOOKUP($A5, Stat!$A$1:$C$501, 3,0)","v":0},null,null,null,1,"314",null,null,60,0,null,"Total leaps length more than X notes:  3 is third, 4 is fourth and so on",1]
[302,"Melody","Stepwise","Stepwise motion",">14 any direction",10,null,null,"Long stepwise",{"$f":"VLOOKUP($A6, Stat!$A$1:$C$501, 2,0)","v":15},{"$f":"VLOOKUP($A6, Stat!$A$1:$C$501, 3,0)","v":0},null,null,null,null,null,null,null,60,0,"There are more than X notes going stepwize in the same direction in this counterpoint","Stepwise motion more than X notes in any direction",1]
[303,"Melody","Stepwise","Stepwise motion",">7 one direction",10,null,null,"Long stepwise",{"$f":"VLOOKUP($A7, Stat!$A$1:$C$501, 2,0)","v":6},{"$f":"VLOOKUP($A7, Stat!$A$1:$C$501, 3,0)","v":0},null,null,null,null,null,null,null,60,0,"There are more than X notes going stepwize in the same direction in this counterpoint","Stepwise motion more than X notes in one direction",1]
[311,"Melody","Leaps","Many leaps within 9 notes",">5 leaps","10",null,null,"!srn!",{"$f":"VLOOKUP($A8, Stat!$A$1:$C$501, 2,0)","v":0},{"$f":"VLOOKUP($A8, Stat!$A$1:$C$501, 3,0)","v":0},null,1,null,1,null,null,null,0,0,null,null,1]
[312,"Melody","Leaps","Many leaps within 9 notes",">18 notes","10",null,null,"Many leaps",{"$f":"VLOOKUP($A9, Stat!$A$1:$C$501, 2,0)","v":0},{"$f":"VLOOKUP($A9, Stat!$A$1:$C$501, 3,0)","v":0},null,1,null,1,null,null,null,0,0,null,"Total leaps length more than X notes:  3 is third, 4 is fourth and so on",1]
[313,"Melody","Leaps","Many leaps within 15 notes",">7 leaps","10",null,null,"!srn!",{"$f":"VLOOKUP($A10, Stat!$A$1:$C$501, 2,0)","v":0},{"$f":"VLOOKUP($A10, Stat!$A$1:$C$501, 3,0)","v":0},null,1,null,1,null,null,null,0,0,null,null,1]
[314,"Melody","Leaps","Many leaps within 15 notes",">26 notes","10",null,null,"Many leaps",{"$f":"VLOOKUP($A11, Stat!$A$1:$C$501, 2,0)","v":0},{"$f":"VLOOKUP($A11, Stat!$A$1:$C$501, 3,0)","v":0},null,1,null,1,null,null,null,0,0,null,"Total leaps length more than X notes:  3 is third, 4 is fourth and so on",1]
[6,"Melody","Leaps","Consecutive unidirectional 3rds","without 6/8","10",null,null,"2 x 3rds",{"$f":"VLOOKUP($A12, Stat!$A$1:$C$501, 2,0)","v":0},{"$f":"VLOOKUP($A12, Stat!$A$1:$C$501, 3,0)","v":0},1,null,null,null,null,null,null,60,0,"There are two immediately adjacent 3rd leaps going in the same direction","There is no 6th or 8va leap before in an opposite direction",1]
[27,"Melody","Leaps","Consecutive unidirectional leaps","Sum >5th","10",null,null,"Leaps",{"$f":"VLOOKUP($A13, Stat!$A$1:$C$501, 2,0)","v":0},{"$f":"VLOOKUP($A13, Stat!$A$1:$C$501, 3,0)","v":0},null,null,null,null,null,null,null,100,0,"There are two immediately adjacent leaps going in the same direction",null,1]
[28,"Melody","Leaps","Consecutive unidirectional 3rds","after 6/8","10",null,null,"2 x 3rds",{"$f":"VLOOKUP($A14, Stat!$A$1:$C$501, 2,0)","v":0},{"$f":"VLOOKUP($A14, Stat!$A$1:$C$501, 3,0)","v":0},1,null,null,null,null,null,null,0,-1,"There are two immediately adjacent 3rd leaps going in the same direction","After 6th or 8va leap in an opposite direction",1]
[70,"Melody","Leaps","Consecutive leaps: 1x3rd ignored","3","10",null,null,"Consecutive leaps",{"$f":"VLOOKUP($A15, Stat!$A$1:$C$501, 2,0)","v":0},{"$f":"VLOOKUP($A15, Stat!$A$1:$C$501, 3,0)","v":0},null,null,null,1,null,null,null,60,0,"There are more than X leaps. Several Y specified 3rd leaps are allowed and not counted. Not idiomatic for voice.",null,1]
[71,"Melody","Leaps","Consecutive leaps: 1x3rd ignored",">3","10",null,null,"Consecutive leaps",{"$f":"VLOOKUP($A16, Stat!$A$1:$C$501, 2,0)","v":0},{"$f":"VLOOKUP($A16, Stat!$A$1:$C$501, 3,0)","v":0},null,null,null,1,"70",null,null,100,0,"There are more than X leaps. Several Y specified 3rd leaps are allowed and not counted. Not idiomatic for voice.",null,1]

{"sheet":"viz","index":4,"n_rows":59,"n_cols":4,"rows_kept":59,"cut":false,"hidden":false,"merged":[]}
["Rule group","Shape","Text in staff","Shegolev"]
["Compensated leap","Slur","-"]
["Uncompensated leap","Slur","-"]
["Leap melody direction change","Slur","-"]
["Leap back","Slur","-"]
["Leap size","Slur","-"]
["Many leaps","Text spanner","Many leaps","Bracket"]
["2 consecutive 3rds","Text spanner","2 x 3rds","Bracket"]
["Long stepwize motion","Text spanner","Long stepwise","Bracket"]
["Multiple culminations","-","-"]
["Repeats","Vertical bracket","Repeat"]
["Many tonic notes / chords","Trill","Many tonics"]
["Stagnation, constrained local range, no development","Trill","Stagnation"]
["Letter repeat/miss","Trill","Repeat/miss"]
["Melodic tritone","Interval text","tri"]
["Skipped notes","-","-"]
["Voice range","-","-"]
["Total range","-","-"]
["Interval between voices","Pedal bracket","int >16th"]
["Harmonic mistakes","Harmony text","-"]
["First/last intervals","Interval text","-"]
["Unaltered VII before Im","Bracket","VII before Im","Text spanner"]
["Unaltered VII 10 after VII#","Bracket","VII after VII#","Text spanner"]
["VII near VI#","Bracket","VII near VI#","Text spanner"]
["VI# without VII#","-","-"]
["Leap to VI#","Slur","-"]
["Altered neighbor","Bracket","VI# (or VII#)","Text spanner"]
["Altered far neighbor","Bracket","VI# (or VII#)","Text spanner"]
["False cross relation","-","-"]
["Altered harmonic interval","Interval text","-"]
{"$rows_left_out":30}
{"sheet":"viz2","index":5,"n_rows":17,"n_cols":2,"rows_kept":17,"cut":false,"hidden":false,"merged":[]}
[]
[]
["Названия строк","Количество по полю Rule group"]
["-",13]
["Ottava bracket",7]
["Slur",7]
["Interval text",6]
["Bracket",6]
["Pedal bracket",4]
["Trill",3]
["Glis",3]
["Text spanner",3]
["Vertical bracket",2]
["Bracket + interval text",1]
["Volta",1]
["Harmony text",1]
["Общий итог",57]

{"sheet":"Missing","index":6,"n_rows":145,"n_cols":1,"rows_kept":145,"cut":false,"hidden":false,"merged":[]}
["Rid"]
[4]
[5]
[6]
[7]
[9]
[11]
[13]
[14]
[32]
[33]
[34]
[35]
[37]
[38]
[40]
[46]
[49]
[50]
[51]
[52]
[75]
[80]
[81]
[82]
[86]
[87]
[96]
[98]
[261]
{"$rows_left_out":116}
{"sheet":"Colors","index":7,"n_rows":0,"n_cols":0,"rows_kept":0,"cut":false,"hidden":false,"merged":[]}

{"sheet":"Stat","index":8,"n_rows":1001,"n_cols":3,"rows_kept":1001,"cut":false,"hidden":false,"merged":[]}
["Rule ID","Freq","Confirmed"]
[0,0,0]
[1,15,1]
[2,8,2]
[3,0,0]
[4,0,0]
[5,0,0]
[6,0,0]
[7,2,1]
[8,491,1]
[9,0,0]
[10,39,1]
[11,29,1]
[12,108,39]
[13,55,10]
[14,185,26]
[15,36,2]
[16,20,1]
[17,6,0]
[18,4,0]
[19,33,21]
[20,5,0]
[21,198,1]
[22,24,12]
[23,19,1]
[24,54,9]
[25,0,0]
[26,30,1]
[27,0,0]
[28,0,0]
{"$rows_left_out":972}
{"sheet":"vp","index":9,"n_rows":11,"n_cols":3,"rows_kept":11,"cut":false,"hidden":false,"merged":[]}
["E","B","N"]
["H+B","nH+B","nB"]
["Extreme","With bass","Non-bass"]
[1,1,1]
[2,2,2]
[3,3,3]
[4,4,4]
[5,5,5]
[6,6,6]
[7,7,7]
[8,8,8]

{"sheet":"Cursed","index":10,"n_rows":6,"n_cols":1,"rows_kept":6,"cut":false,"hidden":false,"merged":[]}
["Cursed augmented chord"]
["Damned augmented chord"]
["Goddamn augmented chord"]
["Fucking augmented chord"]
["WTF! Augmented chord"]
["Stupid augmented chord"]

{"sheet":"Dis","index":11,"n_rows":12,"n_cols":13,"rows_kept":12,"cut":false,"hidden":false,"merged":[[0,5,0,8],[0,1,0,4],[0,9,0,12]]}
["Диссонансы за исключениям задержаний и PDD","Секунда / септима / нона",null,null,null,"Кварта / тритон с басом",null,null,null,"Кварта / тритон без баса"]
[null,"Сильн","Прям","Прот","Косв","Сильн","Прям","Прот","Косв","Сильн","Прям","Прот","Косв"]
["Между двумя аккордовыми звуками, вступление скачками"]
["Между двумя аккордовыми звуками, вступление скачком"]
["Между двумя аккордовыми звуками, вступление поступенно"]
["Между аккордовым и неаккордовым звуками, вступление скачками"]
["Между аккордовым и неаккордовым звуками, вступление скачком к аккордовому"]
["Между аккордовым и неаккордовым звуками, вступление скачком к неаккордовому"]
["Между аккордовым и неаккордовым звуками, вступление поступенно"]
["Между двумя неаккордовыми звуками, вступление скачками"]
["Между двумя неаккордовыми звуками, вступление скачком"]
["Между двумя неаккордовыми звуками, вступление поступенно"]

{"sheet":"Ivls","index":12,"n_rows":13,"n_cols":12,"rows_kept":13,"cut":false,"hidden":false,"merged":[[1,3,1,11],[1,0,1,2],[2,0,3,2]]}
["LN1","LN2","LN3",9,11,0,2,4,5,6,7,8]
["Lower note",null,null,"Upper melodic minor note"]
[null,null,null,"I","II","III","IV","V","VI","VI#","VII","VII#"]
[null,null,null,"A","B","C","D","E","F","F#","G","G#"]
[9,"I","A","1|8","M2|M9","m3","4","5","m6","M6","m7","M7"]
[11,"II","B","m7","1|8","m2|m9","m3","4","dim5","5","m6","M6"]
[0,"III","C","M6","M7","1|8","M2|M9","m3","4","aug4","5","aug5"]
[2,"IV","D","5","M6","m7","1|8","M2|M9","m3","M3","4","aug4"]
[4,"V","E","4","5","m6","m7","1|8","m2|m9","M2|M9","m3","M3"]
[5,"VI","F","M3","aug4","5","M6","M7","1|8","aug1|aug8","M2|M9","aug2|aug9"]
[6,"VI#","F#","m3","4","dim5","m6","m7","M7","1|8","m2|m9","M2|M9"]
[7,"VII","G","M2|M9","M3","4","5","M6","m7","M7","1|8","aug1|aug8"]
[8,"VII#","G#","m2|m9","m3","dim4","dim5","m6","dim7","m7","dim8","1|8"]